{"text_format":"1","workbook":"xlsx","n_sheets":11,"sheets":["Startseite","St Ersp","EB ZZ","Rend","DruckStErsp","DruckEBZZ","DruckRend","Steuerber1","Steuerber2","Steuerber22","Steuerber3"],"not_rendered":{"charts":2,"images":2,"macros":1,"external_links":1,"defined_names":16,"comments":0,"pivot_tables":0},"unopened":[],"bounds":{"document_bytes":16777216,"sheet_cells":100000,"rows_first":2000,"rows_last":500,"rows_between":2000,"halvings":0,"cell_chars":16384,"cell_head_chars":4096},"cells_cut":0,"cells_raw":0,"read":"whole","date_system":"1900"}

{"sheet":"Startseite","index":0,"n_rows":35,"n_cols":19,"rows_kept":35,"cut":false,"hidden":false,"merged":[[33,7,33,16],[33,1,33,4],[33,18,33,29],[1,13,1,29],[2,13,4,29],[5,13,6,29],[8,1,9,27],[13,1,14,29]]}
[]
[]
[null,null,null,null,null,null,null,null,null,null,null,null,null,"Basisrente für Selbstständige"]
[]
[]
[null,null,null,null,null,null,null,null,null,null,null,null,null,"Die Basisrente ist für Selbstständige die einzige geförderte Form der Altersvorsorge."]
[]
[]
[null,"Zusätzlich kann die Basisrente mit Zuzahlungen flexibel bespart werden. Dies ist gerade für Selbstständige mit schwankenden Jahreseinkünften sehr interessant."]
[]
[]
[]
[]
[null,"Folgende Berechnungsmöglichkeiten stehen Ihnen zur Verfügung."]
[]
{"$rows_left_out":21}
{"sheet":"St Ersp","index":1,"n_rows":37,"n_cols":26,"rows_kept":37,"cut":false,"hidden":false,"merged":[[1,13,1,29],[8,1,9,27],[5,13,6,29],[2,13,4,29],[26,16,26,27],[29,25,29,27],[18,25,18,27],[16,22,16,27],[20,22,20,27],[22,25,22,27],[24,22,24,27]]}
[]
[]
[null,null,null,null,null,null,null,null,null,null,null,null,null,"Basisrente für Selbstständige -"]
[]
[]
[null,null,null,null,null,null,null,null,null,null,null,null,null,"flexibel und als einzige Form der Altersvorsorge steuerlich gefördert"]
[]
[]
[null,"Mit flexiblen Zuzahlungen sparen Sie Steuern und sorgen gleichzeitig für Ihr Alter vor."]
[]
[]
[]
[]
[null,"Berechnung Ihrer Steuerersparnis durch Ihre Zuzahlung"]
[]
{"$rows_left_out":23}
{"sheet":"EB ZZ","index":2,"n_rows":39,"n_cols":26,"rows_kept":39,"cut":false,"hidden":false,"merged":[[18,22,18,27],[26,22,26,27],[30,22,30,27],[1,13,1,29],[2,13,4,29],[5,13,6,29],[8,1,9,27],[16,22,16,27],[13,1,13,27],[32,22,32,27],[28,22,28,27],[22,25,22,27],[20,25,20,27],[24,22,24,27]]}
[]
[]
[null,null,null,null,null,null,null,null,null,null,null,null,null,"Basisrente für Selbstständige -"]
[]
[]
[null,null,null,null,null,null,null,null,null,null,null,null,null,"flexibel und als einzige Form der Altersvorsorge steuerlich gefördert"]
[]
[]
[null,"Mit flexiblen Zuzahlungen sparen Sie Steuern und sorgen gleichzeitig für Ihr Alter vor."]
[]
[]
[]
[]
[null,"Berechnung Ihrer Zuzahlung zur Vermeidung einer Steuernachzahlung"]
[]
{"$rows_left_out":25}
{"sheet":"Rend","index":3,"n_rows":39,"n_cols":26,"rows_kept":39,"cut":false,"hidden":false,"merged":[[1,13,1,29],[8,1,9,27],[16,22,16,27],[18,25,18,27],[12,1,14,29],[2,13,4,29],[5,13,6,29],[36,25,36,27],[20,25,20,27],[22,22,22,27],[24,22,24,27],[26,25,26,27],[28,22,28,27],[34,22,34,27],[32,16,32,27]]}
[null,null,null,null,null,null,null,"Eingang"]
[]
[null,null,null,null,null,null,null,null,null,null,null,null,null,"Basisrente für Selbstständige -"]
[]
[]
[null,null,null,null,null,null,null,null,null,null,null,null,null,"Die Basisrente ist für Selbstständige die einzige geförderte Form der Altersvorsorge."]
[]
[]
[null,{"$f":"CONCATENATE(\"Im Jahr \",$Z$21,\" wirken sich bereits \",VLOOKUP($Z$21,Steuerber3!$K$3:$M$12,3,FALSE)*100,\"% der Beiträge, also bis zu \",ROUNDDOWN(24305*VLOOKUP($Z$21,Steuerber3!$K$3:$M$12,3,FALSE),0),\" EUR bzw. \",ROUNDDOWN(48608*VLOOKUP($Z$21,Steuerber3!$K$3:$M$12,3,FALSE),0),\" EUR, steuermindernd aus. Bis 2025 werden daraus noch 100%.\")","v":"Im Jahr 2019 wirken sich bereits 88% der Beiträge, also bis zu 21388 EUR bzw. 42775 EUR, steuermindernd aus. Bis 2025 werden daraus noch 100%."}]
[]
[]
[]
[null,"Berechnen Sie welchen Zins eine ungeförderte Anlage erzielen müsste um bei gleichem Nettoaufwand die Garantie der Basisrente zu erbringen."]
[]
[]
{"$rows_left_out":25}
{"sheet":"DruckStErsp","index":4,"n_rows":48,"n_cols":45,"rows_kept":48,"cut":false,"hidden":false,"merged":[[22,29,22,30],[20,29,20,30],[16,27,16,30],[45,1,46,1],[39,2,40,30],[42,2,43,30],[30,29,30,30],[45,2,46,31],[22,25,22,28],[36,2,36,26],[36,27,36,28],[30,26,30,28],[26,24,26,30],[36,29,36,30],[28,29,28,30],[28,25,28,28],[2,14,2,31],[4,14,5,31],[11,2,12,31],[20,25,20,28],[14,26,14,30],[7,2,8,30]]}
[]
[]
[null,null,null,null,null,null,null,null,null,null,null,null,null,null,"Basisrente für Selbstständige –"]
[]
[null,null,null,null,null,null,null,null,null,null,null,null,null,null,{"$f":"'St Ersp'!N6","v":"flexibel und als einzige Form der Altersvorsorge steuerlich gefördert"}]
[]
[]
[null,null,{"$f":"Rend!B9","v":"Im Jahr 2019 wirken sich bereits 88% der Beiträge, also bis zu 21388 EUR bzw. 42775 EUR, steuermindernd aus. Bis 2025 werden daraus noch 100%."}]
[]
[]
[]
[null,null,{"$f":"'St Ersp'!B9","v":"Mit flexiblen Zuzahlungen sparen Sie Steuern und sorgen gleichzeitig für Ihr Alter vor."}]
[]
[]
[null,null,{"$f":"CONCATENATE(\"Berechnung für \",Startseite!B34,\" \",Startseite!H34,\" \",Startseite!S34)","v":"Berechnung für Herrn Martin Muster"},null,null,null,null,null,null,null,null,null,null,null,null,null,null,null,null,null,null,null,null,null,null,null,{"$f":"TODAY()","v":"2019-12-03"}]
{"$rows_left_out":34}
{"sheet":"DruckEBZZ","index":5,"n_rows":50,"n_cols":41,"rows_kept":50,"cut":false,"hidden":false,"merged":[[46,1,47,1],[46,2,47,31],[32,25,32,28],[31,25,31,28],[43,2,44,30],[37,2,37,26],[37,27,37,28],[37,29,37,30],[17,27,17,30],[33,25,33,28],[31,29,31,30],[35,25,35,28],[23,25,23,28],[23,29,23,30],[21,25,21,28],[21,29,21,30],[25,25,25,28],[25,29,25,30],[27,24,27,30],[33,29,33,30],[29,29,29,30],[35,29,35,30],[29,25,29,28],[2,14,2,31],[4,14,5,31],[7,2,8,30],[11,2,13,31],[15,26,15,30]]}
[]
[]
[null,null,null,null,null,null,null,null,null,null,null,null,null,null,"Basisrente für Selbstständige –"]
[]
[null,null,null,null,null,null,null,null,null,null,null,null,null,null,{"$f":"'St Ersp'!N6","v":"flexibel und als einzige Form der Altersvorsorge steuerlich gefördert"}]
[]
[]
[null,null,{"$f":"Rend!B9","v":"Im Jahr 2019 wirken sich bereits 88% der Beiträge, also bis zu 21388 EUR bzw. 42775 EUR, steuermindernd aus. Bis 2025 werden daraus noch 100%."}]
[]
[]
[]
[null,null,{"$f":"'St Ersp'!B9&\" Mit Zuzahlungen vermeiden Sie Steuernachzahlungen für das laufende Jahr und erhöhte Vorauszahlungen im nächsten Jahr.\"","v":"Mit flexiblen Zuzahlungen sparen Sie Steuern und sorgen gleichzeitig für Ihr Alter vor. Mit Zuzahlungen vermeiden Sie Steuernachzahlungen für das laufende Jahr und erhöhte Vorauszahlungen im nächsten Jahr."}]
[]
[]
[]
{"$rows_left_out":36}
{"sheet":"DruckRend","index":6,"n_rows":51,"n_cols":30,"rows_kept":51,"cut":false,"hidden":false,"merged":[[2,14,2,31],[4,14,5,31],[9,2,10,31],[32,25,32,28],[30,29,30,30],[26,27,26,28],[18,25,18,28],[20,27,20,28],[22,25,22,28],[7,2,8,30],[14,26,14,30],[18,29,18,30],[20,29,20,30],[22,29,22,30],[24,29,24,30],[24,25,24,28],[28,29,28,30],[41,2,42,30],[36,2,38,32],[47,1,48,1],[47,2,48,31],[32,29,32,30],[28,26,28,28],[30,25,30,28],[34,26,34,28]]}
[]
[]
[null,null,null,null,null,null,null,null,null,null,null,null,null,null,"Basisrente für Selbstständige –"]
[]
[null,null,null,null,null,null,null,null,null,null,null,null,null,null,{"$f":"Rend!N6","v":"Die Basisrente ist für Selbstständige die einzige geförderte Form der Altersvorsorge."}]
[]
[]
[null,null,{"$f":"Rend!B9","v":"Im Jahr 2019 wirken sich bereits 88% der Beiträge, also bis zu 21388 EUR bzw. 42775 EUR, steuermindernd aus. Bis 2025 werden daraus noch 100%."}]
[]
[null,null,"Deshalb erzielen Selbstständige mit der Basisrente schon ohne Berücksichtigung einer Verzinsung/Wertentwicklung eine ansehnliche Rendite."]
[]
[]
[]
[]
[null,null,{"$f":"CONCATENATE(\"Berechnung für \",Startseite!B34,\" \",Startseite!H34,\" \",Startseite!S34)","v":"Berechnung für Herrn Martin Muster"},null,null,null,null,null,null,null,null,null,null,null,null,null,null,null,null,null,null,null,null,null,null,null,{"$f":"TODAY()","v":"2019-12-03"}]
{"$rows_left_out":37}
{"sheet":"Steuerber1","index":7,"n_rows":47,"n_cols":22,"rows_kept":47,"cut":false,"hidden":false,"merged":[[17,2,17,7],[19,2,19,7]]}
[]
[null,"zu versteuerndes Einkommen",{"$f":"'St Ersp'!W21","v":100000},null,null,null,null,null,null,"Jahr","Beitragsjahr","Beitrag","absetzbar","verm. zvE","zvE","Steuer neu\nohne SolZ","Ersparnis \nmit SolZ","Nettoaufwand","Nettoaufwand verzinst"]
[null,null,null,null,null,null,null,null,null,1,2019,{"$f":"IF(K3<$K$3+$C$10,$C$12,0)","v":10000},0.88,{"$f":"IF(K3<$K$3+$C$10,L3*M3,0)","v":8800},{"$f":"IF(K3<$K$3+$C$10,zvE-N3,0)","v":91200},{"$f":"ROUNDDOWN(IF((O3/$D$6)<(9168+1),0,IF((O3/$D$6)<(14254+1),(980.14*(((O3/$D$6)-9169)/10000)+1400)*((O3/$D$6)-9168)/10000,IF((O3/$D$6)<(55960+1),(216.16*(((O3/$D$6)-14255)/10000)+2397)*((O3/$D$6)-14255)/10000+965.58,IF((O3/$D$6)<(265326+1),(O3/$D$6)*0.42-8780.9,(O3/$D$6)*0.45-16740.68)))),0)*$D$6","v":29523},{"$f":"IF(K3<$K$3+$C$10,ROUNDDOWN(($C$32-P3)*(1.055+KiSt),2),0)","v":4231.92},{"$f":"IF(K3<$K$3+$C$10,L3-Q3,0)","v":5768.08},{"$f":"IF(K3<$K$3+$C$10,ROUNDDOWN(R3*(1+$C$22),2),0)","v":6604.41},null,"Jahr 2019"]
[null,"Kirchensteuersatz",{"$f":"'St Ersp'!Z23","v":0.09},null,null,null,null,null,null,2,2020,{"$f":"IF(K4<$K$3+$C$10,$C$12,0)","v":10000},0.9,{"$f":"IF(K4<$K$3+$C$10,L4*M4,0)","v":9000},91000,{"$f":"ROUNDDOWN(IF((O4/$D$6)<(9168+1),0,IF((O4/$D$6)<(14254+1),(980.14*(((O4/$D$6)-9169)/10000)+1400)*((O4/$D$6)-9168)/10000,IF((O4/$D$6)<(55960+1),(216.16*(((O4/$D$6)-14255)/10000)+2397)*((O4/$D$6)-14255)/10000+965.58,IF((O4/$D$6)<(265326+1),(O4/$D$6)*0.42-8780.9,(O4/$D$6)*0.45-16740.68)))),0)*$D$6","v":29439},4328.1000000000004,{"$f":"IF(K4<$K$3+$C$10,L4-Q4,0)","v":5671.9},{"$f":"IF(K4<$K$3+$C$10,ROUNDDOWN((R4+S3)*(1+$C$22),2),0)","v":14056.29},null,"bis 9.168 Euro","(Grundfreibetrag): 0"]
[null,null,null,null,null,null,null,null,null,3,2021,10000,0.92,9200,90800,29355,4424.28,5575.72,{"$f":"IF(K5<$K$3+$C$10,ROUNDDOWN((R5+S4)*(1+$C$22),2),0)","v":22478.52},null,"9.168 Euro bis 14.254 Euro:","ESt = (980.14 · Y + 1.400) · Y"]
[null,"Familienstand",null,{"$f":"IF('St Ersp'!W25=\"Grundtabelle\",1,2)","v":1},null,null,null,null,null,4,2022,10000,0.94,9400,90600,29271,4520.46,5479.54,32011.79,null,null,"Y = (zvE - 9.168) / 10.000"]
[null,null,null,null,null,null,null,null,null,5,2023,10000,0.96,9600,90400,29187,4616.6400000000003,5383.36,42817.19,null,"14.255 Euro bis 55.960 Euro:","ESt = (216.16 × Z + 2.397) × Z + 965.58"]
[null,"Basisrente",null,null,null,null,null,null,null,6,2024,10000,0.98,9800,90200,29103,4712.82,5287.18,55079.18,null,null,"Z = (zvE - 14.254) / 10.000"]
[null,null,null,null,null,null,null,null,null,7,2025,10000,1,10000,90000,29019,4809,5191,69008.95,null,"54.950 Euro bis 265.326 Euro:","ESt = 0,42 × zvE - 8780.9"]
[null,"Laufzeit",{"$f":"'St Ersp'!Z19","v":2019},null,null,null,null,null,null,8,2026,10000,0.999999999999999,9999.9999999999909,90000.000000000015,29019,4809,5191,84958.44,null,"ab 265.327 Euro:","ESt = 0,45 × zvE - 16740.68"]
[null,null,null,null,null,null,null,null,null,9,2027,10000,1,10000,90000,29019,4809,5191,103220.5]
[null,"Jahresbeitrag",{"$f":"'St Ersp'!W17","v":10000},null,null,null,null,null,null,10,2028,10000,1,10000,90000,29019,4809,5191,124130.44,null,"In §39b Absatz 2 Satz 7 zweiter Halbsatz wird die Angabe \"10440\" durch"]
[null,null,null,null,null,null,null,null,null,11,2029,10000,1,10000,90000,29019,4809,5191,148072.18,null,"die Angabe \"10635\" ersetzt."]
[null,"Beitragssumme = Garantie",{"$f":"C10*C12","v":20190000},null,null,null,null,null,null,12,2030,10000,1,10000,90000,29019,4809,5191,175485.31]
[null,null,null,null,null,null,null,null,null,13,2031,10000,1,10000,90000,29019,4809,5191,206873.16]
{"$rows_left_out":33}
{"sheet":"Steuerber2","index":8,"n_rows":47,"n_cols":22,"rows_kept":47,"cut":false,"hidden":false,"merged":[[17,2,17,7],[19,2,19,7]]}
[]
[null,"zu versteuerndes Einkommen",{"$f":"'EB ZZ'!W17+'EB ZZ'!W19","v":80000},null,null,null,null,null,null,null,"Beitragsjahr","Mehrgewinn","absetzbar","verm. zvE","zvE","Steuer neu\nohne SolZ","Ersparnis \nmit SolZ","Nettoaufwand","Nettoaufwand verzinst"]
[null,null,null,null,null,null,null,null,null,1,2019,{"$f":"IF(K3<$K$3+$C$10,$C$12,0)","v":10000},1,{"$f":"IF(K3<$K$3+$C$10,L3*M3,0)","v":10000},{"$f":"IF(K3<$K$3+$C$10,zvE-N3,0)","v":70000},{"$f":"ROUNDDOWN(IF((O3/$D$6)<(9168+1),0,IF((O3/$D$6)<(14254+1),(980.14*(((O3/$D$6)-9169)/10000)+1400)*((O3/$D$6)-9168)/10000,IF((O3/$D$6)<(55960+1),(216.16*(((O3/$D$6)-14255)/10000)+2397)*((O3/$D$6)-14255)/10000+965.58,IF((O3/$D$6)<(265326+1),(O3/$D$6)*0.42-8780.9,(O3/$D$6)*0.45-16740.68)))),0)*$D$6","v":20619},{"$f":"IF(K3<$K$3+$C$10,ROUNDDOWN(($C$32-P3)*(1.055+KiSt),2),0)","v":4809},{"$f":"IF(K3<$K$3+$C$10,L3-Q3,0)","v":5191},{"$f":"IF(K3<$K$3+$C$10,ROUNDDOWN(R3*(1+$C$22),2),0)","v":5943.66},null,"Jahr 2019"]
[null,"Kirchensteuersatz",{"$f":"'St Ersp'!Z23","v":0.09},null,null,null,null,null,null,2,2020,{"$f":"IF(K4<$K$3+$C$10,$C$12,0)","v":10000},1,{"$f":"IF(K4<$K$3+$C$10,L4*M4,0)","v":10000},70000,{"$f":"ROUNDDOWN(IF((O4/$D$6)<(9168+1),0,IF((O4/$D$6)<(14254+1),(980.14*(((O4/$D$6)-9169)/10000)+1400)*((O4/$D$6)-9168)/10000,IF((O4/$D$6)<(55960+1),(216.16*(((O4/$D$6)-14255)/10000)+2397)*((O4/$D$6)-14255)/10000+965.58,IF((O4/$D$6)<(265326+1),(O4/$D$6)*0.42-8780.9,(O4/$D$6)*0.45-16740.68)))),0)*$D$6","v":20619},4809,{"$f":"IF(K4<$K$3+$C$10,L4-Q4,0)","v":5191},{"$f":"IF(K4<$K$3+$C$10,ROUNDDOWN((R4+S3)*(1+$C$22),2),0)","v":12749.11},null,"bis 9.168 Euro","(Grundfreibetrag): 0"]
[null,null,null,null,null,null,null,null,null,3,2021,10000,1,10000,70000,20619,4809,5191,{"$f":"IF(K5<$K$3+$C$10,ROUNDDOWN((R5+S4)*(1+$C$22),2),0)","v":20541.3},null,"9.168 Euro bis 14.254 Euro:","ESt = (980.14 · Y + 1.400) · Y"]
[null,"Familienstand",null,{"$f":"IF('St Ersp'!W25=\"Grundtabelle\",1,2)","v":1},null,null,null,null,null,4,2022,10000,1,10000,70000,20619,4809,5191,29463.31,null,null,"Y = (zvE - 9.168) / 10.000"]
[null,null,null,null,null,null,null,null,null,5,2023,10000,1,10000,70000,20619,4809,5191,39678.949999999997,null,"14.255 Euro bis 55.960 Euro:","ESt = (216.16 × Z + 2.397) × Z + 965.58"]
[null,"Basisrente",null,null,null,null,null,null,null,6,2024,10000,1,10000,70000,20619,4809,5191,51375.79,null,null,"Z = (zvE - 14.254) / 10.000"]
[null,null,null,null,null,null,null,null,null,7,2025,10000,1,10000,70000,20619,4809,5191,64768.59,null,"54.950 Euro bis 265.326 Euro:","ESt = 0,42 × zvE - 8780.9"]
[null,"Laufzeit",{"$f":"'St Ersp'!Z19","v":2019},null,null,null,null,null,null,8,2026,10000,1,10000,70000,20619,4809,5191,80103.259999999995,null,"ab 265.327 Euro:","ESt = 0,45 × zvE - 16740.68"]
[null,null,null,null,null,null,null,null,null,9,2027,10000,1,10000,70000,20619,4809,5191,97661.35]
[null,"Jahresbeitrag",{"$f":"'EB ZZ'!W19","v":10000},null,null,null,null,null,null,10,2028,10000,1,10000,70000,20619,4809,5191,117765.25,null,"In §39b Absatz 2 Satz 7 zweiter Halbsatz wird die Angabe \"10440\" durch"]
[null,null,null,null,null,null,null,null,null,11,2029,10000,1,10000,70000,20619,4809,5191,140784.07999999999,null,"die Angabe \"10635\" ersetzt."]
[null,"Beitragssumme = Garantie",{"$f":"C10*C12","v":20190000},null,null,null,null,null,null,12,2030,10000,1,10000,70000,20619,4809,5191,167140.49]
[null,null,null,null,null,null,null,null,null,13,2031,10000,1,10000,70000,20619,4809,5191,197318.39999999999]
{"$rows_left_out":33}
{"sheet":"Steuerber22","index":9,"n_rows":47,"n_cols":22,"rows_kept":47,"cut":false,"hidden":false,"merged":[[17,2,17,7],[19,2,19,7]]}
[]
[null,"zu versteuerndes Einkommen",{"$f":"'EB ZZ'!W17+'EB ZZ'!W19","v":80000},null,null,null,null,null,null,null,"Beitragsjahr","Beitrag","absetzbar","verm. zvE","zvE","Steuer neu\nohne SolZ","Ersparnis \nmit SolZ","Nettoaufwand","Nettoaufwand verzinst"]
[null,null,null,null,null,null,null,null,null,1,2019,{"$f":"IF(K3<$K$3+$C$10,$C$12,0)","v":11363.636363636364},0.88,{"$f":"IF(K3<$K$3+$C$10,L3*M3,0)","v":10000},{"$f":"IF(K3<$K$3+$C$10,zvE-N3,0)","v":70000},{"$f":"ROUNDDOWN(IF((O3/$D$6)<(9168+1),0,IF((O3/$D$6)<(14254+1),(980.14*(((O3/$D$6)-9169)/10000)+1400)*((O3/$D$6)-9168)/10000,IF((O3/$D$6)<(55960+1),(216.16*(((O3/$D$6)-14255)/10000)+2397)*((O3/$D$6)-14255)/10000+965.58,IF((O3/$D$6)<(265326+1),(O3/$D$6)*0.42-8780.9,(O3/$D$6)*0.45-16740.68)))),0)*$D$6","v":20619},{"$f":"IF(K3<$K$3+$C$10,ROUNDDOWN(($C$32-P3)*(1.055+KiSt),2),0)","v":4809},{"$f":"IF(K3<$K$3+$C$10,L3-Q3,0)","v":6554.636363636364},{"$f":"IF(K3<$K$3+$C$10,ROUNDDOWN(R3*(1+$C$22),2),0)","v":7505.01},null,"Jahr 2019"]
[null,"Kirchensteuersatz",{"$f":"'St Ersp'!Z23","v":0.09},null,null,null,null,null,null,2,2020,{"$f":"IF(K4<$K$3+$C$10,$C$12,0)","v":11363.636363636364},0.9,{"$f":"IF(K4<$K$3+$C$10,L4*M4,0)","v":10227.272727272728},69772.727272727265,{"$f":"ROUNDDOWN(IF((O4/$D$6)<(9168+1),0,IF((O4/$D$6)<(14254+1),(980.14*(((O4/$D$6)-9169)/10000)+1400)*((O4/$D$6)-9168)/10000,IF((O4/$D$6)<(55960+1),(216.16*(((O4/$D$6)-14255)/10000)+2397)*((O4/$D$6)-14255)/10000+965.58,IF((O4/$D$6)<(265326+1),(O4/$D$6)*0.42-8780.9,(O4/$D$6)*0.45-16740.68)))),0)*$D$6","v":20523},4918.92,{"$f":"IF(K4<$K$3+$C$10,L4-Q4,0)","v":6444.7163636363639},{"$f":"IF(K4<$K$3+$C$10,ROUNDDOWN((R4+S3)*(1+$C$22),2),0)","v":15972.34},null,"bis 9.168 Euro","(Grundfreibetrag): 0"]
[null,null,null,null,null,null,null,null,null,3,2021,11363.636363636364,0.92,10454.545454545456,69545.454545454544,20428,5027.6899999999996,6335.9463636363644,{"$f":"IF(K5<$K$3+$C$10,ROUNDDOWN((R5+S4)*(1+$C$22),2),0)","v":25542.83},null,"9.168 Euro bis 14.254 Euro:","ESt = (980.14 · Y + 1.400) · Y"]
[null,"Familienstand",null,{"$f":"IF('St Ersp'!W25=\"Grundtabelle\",1,2)","v":1},null,null,null,null,null,4,2022,11363.636363636364,0.94,10681.818181818182,69318.181818181823,20332,5137.6099999999997,6226.0263636363643,36375.120000000003,null,null,"Y = (zvE - 9.168) / 10.000"]
[null,null,null,null,null,null,null,null,null,5,2023,11363.636363636364,0.96,10909.090909090908,69090.909090909088,20237,5246.39,6117.2463636363636,48653.47,null,"14.255 Euro bis 55.960 Euro:","ESt = (216.16 × Z + 2.397) × Z + 965.58"]
[null,"Basisrente",null,null,null,null,null,null,null,6,2024,11363.636363636364,0.98,11136.363636363636,68863.636363636368,20141,5356.31,6007.3263636363636,62586.239999999998,null,null,"Z = (zvE - 14.254) / 10.000"]
[null,null,null,null,null,null,null,null,null,7,2025,11363.636363636364,1,11363.636363636364,68636.363636363632,20046,5465.08,5898.556363636364,78414.63,null,"54.950 Euro bis 265.326 Euro:","ESt = 0,42 × zvE - 8780.9"]
[null,"Laufzeit",{"$f":"'St Ersp'!Z19","v":2019},null,null,null,null,null,null,8,2026,11363.636363636364,0.999999999999999,11363.636363636353,68636.363636363647,20046,5465.08,5898.556363636364,96538.03,null,"ab 265.327 Euro:","ESt = 0,45 × zvE - 16740.68"]
[null,null,null,null,null,null,null,null,null,9,2027,11363.636363636364,1,11363.636363636364,68636.363636363632,20046,5465.08,5898.556363636364,117289.2]
[null,"Jahresbeitrag",{"$f":"'EB ZZ'!W31","v":11363.636363636364},null,null,null,null,null,null,10,2028,11363.636363636364,1,11363.636363636364,68636.363636363632,20046,5465.08,5898.556363636364,141049.15,null,"In §39b Absatz 2 Satz 7 zweiter Halbsatz wird die Angabe \"10440\" durch"]
[null,null,null,null,null,null,null,null,null,11,2029,11363.636363636364,1,11363.636363636364,68636.363636363632,20046,5465.08,5898.556363636364,168254.14,null,"die Angabe \"10635\" ersetzt."]
[null,"Beitragssumme = Garantie",{"$f":"C10*C12","v":22943181.81818182},null,null,null,null,null,null,12,2030,11363.636363636364,1,11363.636363636364,68636.363636363632,20046,5465.08,5898.556363636364,199403.67]
[null,null,null,null,null,null,null,null,null,13,2031,11363.636363636364,1,11363.636363636364,68636.363636363632,20046,5465.08,5898.556363636364,235069.67]
{"$rows_left_out":33}
{"sheet":"Steuerber3","index":10,"n_rows":48,"n_cols":22,"rows_kept":48,"cut":false,"hidden":false,"merged":[[17,2,17,7],[19,2,19,7],[22,1,27,8]]}
[]
[null,"zu versteuerndes Einkommen",{"$f":"Rend!W25","v":70000},null,null,null,null,null,null,null,"Beitragsjahr","Beitrag","absetzbar","verm. zvE","zvE","Steuer neu\nohne SolZ","Ersparnis \nmit SolZ","Nettoaufwand","Nettoaufwand verzinst"]
[null,null,null,null,null,null,null,null,null,1,2019,{"$f":"IF(K3<$K$3+$C$10,$C$12,0)","v":1200},0.88,{"$f":"IF(K3<$K$3+$C$10,L3*M3,0)","v":1056},{"$f":"IF(K3<$K$3+$C$10,zvE-N3,0)","v":68944},{"$f":"ROUNDDOWN(IF((O3/$D$6)<(9168+1),0,IF((O3/$D$6)<(14254+1),(980.14*(((O3/$D$6)-9169)/10000)+1400)*((O3/$D$6)-9168)/10000,IF((O3/$D$6)<(55960+1),(216.16*(((O3/$D$6)-14255)/10000)+2397)*((O3/$D$6)-14255)/10000+965.58,IF((O3/$D$6)<(265326+1),(O3/$D$6)*0.42-8780.9,(O3/$D$6)*0.45-16740.68)))),0)*$D$6","v":20175},{"$f":"IF(K3<$K$3+$C$10,ROUNDDOWN(($C$32-P3)*(1.055+KiSt),2),0)","v":508.38},{"$f":"IF(K3<$K$3+$C$10,L3-Q3,0)","v":691.62},{"$f":"IF(K3<$K$3+$C$10,ROUNDDOWN(R3*(1+$C$22),2),0)","v":708.26},null,"Jahr 2019"]
[null,"Kirchensteuersatz",{"$f":"Rend!Z27","v":0.09},null,null,null,null,null,null,2,2020,{"$f":"IF(K4<$K$3+$C$10,$C$12,0)","v":1200},0.9,{"$f":"IF(K4<$K$3+$C$10,L4*M4,0)","v":1080},68920,{"$f":"ROUNDDOWN(IF((O4/$D$6)<(9168+1),0,IF((O4/$D$6)<(14254+1),(980.14*(((O4/$D$6)-9169)/10000)+1400)*((O4/$D$6)-9168)/10000,IF((O4/$D$6)<(55960+1),(216.16*(((O4/$D$6)-14255)/10000)+2397)*((O4/$D$6)-14255)/10000+965.58,IF((O4/$D$6)<(265326+1),(O4/$D$6)*0.42-8780.9,(O4/$D$6)*0.45-16740.68)))),0)*$D$6","v":20165},519.83000000000004,{"$f":"IF(K4<$K$3+$C$10,L4-Q4,0)","v":680.17},{"$f":"IF(K4<$K$3+$C$10,ROUNDDOWN((R4+S3)*(1+$C$22),2),0)","v":1421.83},null,"bis 9.168 Euro","(Grundfreibetrag): 0"]
[null,null,null,null,null,null,null,null,null,3,2021,1200,0.92,1104,68896,20155,531.28,668.72,{"$f":"IF(K5<$K$3+$C$10,ROUNDDOWN((R5+S4)*(1+$C$22),2),0)","v":2140.85},null,"9.168 Euro bis 14.254 Euro:","ESt = (980.14 · Y + 1.400) · Y"]
[null,"Familienstand",null,{"$f":"IF(Rend!W29=\"Grundtabelle\",1,2)","v":1},null,null,null,null,null,4,2022,1200,0.94,1128,68872,20145,542.73,657.27,2865.44,null,null,"Y = (zvE - 9.168) / 10.000"]
[null,null,null,null,null,null,null,null,null,5,2023,1200,0.96,1152,68848,20135,554.17999999999995,645.82000000000005,3595.74,null,"14.255 Euro bis 55.960 Euro:","ESt = (216.16 × Z + 2.397) × Z + 965.58"]
[null,"Basisrente",null,null,null,null,null,null,null,6,2024,1200,0.98,1176,68824,20125,565.63,634.37,4331.8900000000003,null,null,"Z = (zvE - 14.254) / 10.000"]
[null,null,null,null,null,null,null,null,null,7,2025,1200,1,1200,68800,20115,577.08000000000004,622.91999999999996,5074.03,null,"54.950 Euro bis 265.326 Euro:","ESt = 0,42 × zvE - 8780.9"]
[null,"Laufzeit",{"$f":"Rend!Z19","v":32},null,null,null,null,null,null,8,2026,1200,0.999999999999999,1199.9999999999989,68800,20115,577.08000000000004,622.91999999999996,5834.02,null,"ab 265.327 Euro:","ESt = 0,45 × zvE - 16740.68"]
[null,null,null,null,null,null,null,null,null,9,2027,1200,0.999999999999999,1199.9999999999989,68800,20115,577.08000000000004,622.91999999999996,6612.3]
[null,"Jahresbeitrag",{"$f":"Rend!W17","v":1200},null,null,null,null,null,null,10,2028,1200,0.999999999999999,1199.9999999999989,68800,20115,577.08000000000004,622.91999999999996,7409.31,null,"In §39b Absatz 2 Satz 7 zweiter Halbsatz wird die Angabe \"10440\" durch"]
[null,null,null,null,null,null,null,null,null,11,2029,1200,0.999999999999999,1199.9999999999989,68800,20115,577.08000000000004,622.91999999999996,8225.49,null,"die Angabe \"10635\" ersetzt."]
[null,"Beitragssumme = Garantie",{"$f":"Rend!W23","v":30720},null,null,null,null,null,null,12,2030,1200,0.999999999999999,1199.9999999999989,68800,20115,577.08000000000004,622.91999999999996,9061.31]
[null,null,null,null,null,null,null,null,null,13,2031,1200,0.999999999999999,1199.9999999999989,68800,20115,577.08000000000004,622.91999999999996,9917.24]
{"$rows_left_out":33}